{"text_format":"1","workbook":"xlsx","n_sheets":12,"sheets":["EingabeMaske","Berechnung und Ergebnis","Vergleichsfaktoren 2021 (2)","Vergleichsdaten 2021","Vergleichsdaten 2022","Vergleichsdaten 2023","GebStandard","RND","Vergleichsfaktoren","modifizierte RND","Info","Werte Neu"],"not_rendered":{"charts":5,"images":4,"macros":1,"external_links":0,"defined_names":449,"comments":2,"pivot_tables":0},"unopened":[],"bounds":{"document_bytes":16777216,"sheet_cells":100000,"rows_first":2000,"rows_last":500,"rows_between":2000,"halvings":0,"cell_chars":16384,"cell_head_chars":4096},"cells_cut":0,"cells_raw":0,"read":"whole","date_system":"1900"}

{"sheet":"EingabeMaske","index":0,"n_rows":57,"n_cols":6,"rows_kept":57,"cut":false,"hidden":false,"merged":[[0,5,3,5],[1,0,1,4],[31,0,31,4],[15,3,15,4],[3,0,3,4],[4,0,4,4],[2,0,2,3],[6,1,6,2],[29,0,29,1],[51,0,51,2],[11,0,11,4],[16,0,16,2],[8,1,8,3],[10,1,10,3],[30,0,30,2],[32,0,32,2],[39,0,39,2],[9,1,9,3]]}
[null,null,null,null,"WE-Rechner 1 - 2023","Bitte beachten Sie den jeweiligen Kommentar\nder Zellen der fünften Spalte (Spalte E).\n\nSofern nicht alle Kommentare gleichzeitig eingeblendet sind,\nhalten Sie die Maus-Positions-Marke (Cursor) über eine Zelle,\nin deren rechter oberer Ecke ein rotes Dreieck angezeigt wird."]
["Vergleichswertberechnung  \"Wohnungseigentum\""]
["gem. § 182 Abs.2 BewG i. V. m. § 183 BewG. "]
[]
[]
[]
["Eingabefelder blau","Berechnungsfelder rot",null,"Kommentar"]
[]
["Bezeichnung des Wertermittlungsobjekts der Bewertung nach § 183 BewG","53449 Bad Neuenahr, Musterstraße 2"]
["Liste der Vergleichsfaktoren",null,null,"Bobenheim-Roxheim - Roxheim"]
["Gemeinde / Gemarkung / Landkreis bzw. Stadt:"," /  / "]
[]
[null,null,null,{"$f":"(YEAR(D15)+1)","v":2021}]
["Merkmale des Wertermittlungsobjekts",null,"Eingabeschranken"]
["Wertermittlungsstichtag (WST):",null,"01.01.2009 bis heute","2020-01-01"]
{"$rows_left_out":43}
{"sheet":"Berechnung und Ergebnis","index":1,"n_rows":116,"n_cols":4,"rows_kept":116,"cut":false,"hidden":false,"merged":[[1,0,1,3],[3,1,3,3],[17,0,17,2],[19,0,19,2],[118,1,118,3],[49,0,49,2],[35,0,35,2],[53,0,53,1],[54,0,54,1],[47,0,47,1],[42,0,42,1],[37,0,37,3],[100,1,100,2],[22,1,22,3],[120,1,120,3],[56,0,56,3],[69,0,69,3],[95,0,95,3],[62,0,62,1],[105,0,105,3]]}
[null,null,null,{"$f":"EingabeMaske!E1","v":"WE-Rechner 1 - 2023"}]
["Vergleichswertberechnung \"Wohnungseigentum\""]
[]
["Bezeichnung des Wertermittlungsobjekts der \nBewertung nach § 183 BewG:",{"$f":"EingabeMaske!B9","v":"53449 Bad Neuenahr, Musterstraße 2"}]
[]
["Merkmale des Wertermittlungsobjekts (WO)"]
[{"$f":"EingabeMaske!A15","v":"Wertermittlungsstichtag (WST):"},null,null,{"$f":"EingabeMaske!D15","v":"2020-01-01"}]
[{"$f":"EingabeMaske!A19","v":"Grundstücksgröße (GG):"},null,null,{"$f":"ROUND(EingabeMaske!D19,0)","v":480}]
["Miteigentumsanteil:",null,null,{"$f":"ROUND(EingabeMaske!D25,4)","v":0.16669999999999999}]
["Baujahr (BJ):",null,null,{"$f":"EingabeMaske!D26","v":1990}]
[{"$f":"EingabeMaske!A20","v":"Gebäudestandardstufe (GST):"},null,null,{"$f":"ROUND(EingabeMaske!D20,2)","v":3}]
["Wohnfläche (WF):",null,null,{"$f":"ROUND(EingabeMaske!D21,1)","v":100}]
["Anzahl der Wohneinheiten in der Wohnanlage",null,null,{"$f":"EingabeMaske!D22","v":10}]
[{"$f":"EingabeMaske!A27","v":"Gesamtnutzungsdauer (GND):"},null,null,{"$f":"ROUND(EingabeMaske!D27,1)","v":70}]
["Restnutzungsdauer (RND):",null,null,{"$f":"ROUND(EingabeMaske!D28,1)","v":40}]
{"$rows_left_out":102}
{"sheet":"Vergleichsfaktoren 2021 (2)","index":2,"n_rows":3022,"n_cols":9,"rows_kept":3022,"cut":false,"hidden":true,"merged":[[0,1,0,8],[1,1,1,8],[2,1,2,8],[3,1,3,8]]}
[null,"Richtwerte (RW) für Wohnungseigentume im Weiterverkauf"]
[null,"Stichtag 1.1.2020, Modell s. LGMB 2021, Kap. 3.6.1.2 - © Oberer Gutachterausschuss für Grundstückswerte Rheinland-Pfalz"]
[null,"Kurzbeschreibung des Richtwertobjekts: 10 Einheiten im Objekt, Grundstücksgröße 1.300 m², mittlerer Standard, Wohnfäche 80 m², Alter 27 Jahre "]
[null,"Hinweis: Sollte eine Gemarkung nicht nachgewiesen sein, kann eine vergleichbare Gemarkung desselben Marktsegments herangezogen werden. "]
["Ergänzung LfSt"]
["Gemeinde / Gemarkung / Landkreis bzw. Stadt","Nr.","Gemarkung","Gemeinde","Landkreis/kreisfreie Stadt","Markt-segment Nr.","BWN €/m² Grdst.fl.","VF €/m² Wohnfl.","SWF"]
[{"$f":"TRIM(D7)&\" / \"&TRIM(C7)&\" / \"&TRIM(E7)","v":" /  / "}]
[{"$f":"TRIM(D8)&\" / \"&TRIM(C8)&\" / \"&TRIM(E8)","v":" /  / "}]
[" /  / "]
[" /  / "]
[" /  / "]
[" /  / "]
[" /  / "]
[" /  / "]
[" /  / "]
{"$rows_left_out":3008}
{"sheet":"Vergleichsdaten 2021","index":3,"n_rows":177,"n_cols":11,"rows_kept":177,"cut":false,"hidden":true,"merged":[]}
[]
["Quelle: Oberer Gutachterausschuss für Grundstückswerte Rheinland-Pfalz gem. Landesgrundstückmarktbericht 2021"]
[]
["Berücksichtigung der Wertverhältnisse zwischen dem Richtwertstichtag"]
[" und dem Wertermittlungsstichtag"]
["RLP"]
["Farblegende:",{"$f":"EingabeMaske!D$15","v":"2020-01-01"},null,null,"Interpolation!",null,"Index","Stichtag","Ergänzung "]
["Fester Wert",{"$f":"B7-DATE(YEAR(B7)-1,12,31.25)","v":1},2023,{"$f":"(G8-G9)*$B9/365+G9","v":208},"2022-01-01","2022-12-31",208,"2023-01-01",{"$f":"ROUND(IF(YEAR($B$7)+1=C8,D8,0),2)","v":0}]
[null,{"$f":"B7-DATE(YEAR(B7)-1,12,31.25)","v":1},2022,{"$f":"(G9-G10)*$B11/365+G10","v":208},"2021-01-01","2021-12-31",208,"2022-01-01",{"$f":"ROUND(IF(YEAR($B$7)+1=C9,D9,0),2)","v":0}]
[null,{"$f":"B7-DATE(YEAR(B7)-1,12,31.25)","v":1},2021,{"$f":"(G10-G11)*$B$16/365+G11","v":189.05205479452056},"2020-01-01","2020-12-31",208,"2021-01-01",189.05]
[null,{"$f":"B7-DATE(YEAR(B7)-1,12,31.25)","v":1},2020,{"$f":"(G11-G12)*$B12/365+G12","v":172.04657534246576},"2019-01-01","2019-12-31",189,"2020-01-01",0]
[null,{"$f":"B7-DATE(YEAR(B7)-1,12,31.25)","v":1},2019,157.04109589041096,"2018-01-01","2018-12-31",172,"2019-01-01",0]
[null,{"$f":"B7-DATE(YEAR(B7)-1,12,31.25)","v":1},2018,{"$f":"(G13-G14)*$B15/365+G14","v":144.03561643835616},"2017-01-01","2017-12-31",157,"2018-01-01",0]
[null,{"$f":"B7-DATE(YEAR(B7)-1,12,31.25)","v":1},2017,{"$f":"(G14-G15)*$B$16/365+G15","v":132.03287671232877},"2016-01-01","2016-12-31",144,"2017-01-01",0]
[null,{"$f":"B7-DATE(YEAR(B7)-1,12,31.25)","v":1},2016,{"$f":"(G15-G16)*$B16/365+G16","v":122.02739726027397},"2015-01-01","2015-12-31",132,"2016-01-01",0]
{"$rows_left_out":163}
{"sheet":"Vergleichsdaten 2022","index":4,"n_rows":400,"n_cols":11,"rows_kept":400,"cut":false,"hidden":true,"merged":[]}
[]
[{"$f":"EingabeMaske!A57","v":"Quelle: Oberer Gutachterausschuss für Grundstückswerte Rheinland-Pfalz gem. Landesgrundstückmarktbericht 2021"}]
[]
["Sachwertfaktoren für Wohnungseigentume",null,null,null,null,null,null,{"$f":"EingabeMaske!E1","v":"WE-Rechner 1 - 2023"}]
[]
["Objektart","Wohnungseigentum"]
["Bodenwertniveau",{"$f":"EingabeMaske!D30","v":300},45,75,130,230,230,430]
["vorläufiger Sachwert",{"$f":"'Berechnung und Ergebnis'!D12*'Berechnung und Ergebnis'!D56","v":{"$error":"#DIV/0!"}},150000,150000,150000,150000,150000,150000]
["Stichtag","2020-01-01","2020-01-01","2020-01-01","2020-01-01","2020-01-01","2020-01-01","2020-01-01"]
["Stichtag als Zahl",{"$f":"B9","v":43831},{"$f":"C9","v":43831},{"$f":"D9","v":43831},43831,43831,43831,43831]
[]
["Marktsegment",{"$f":"VLOOKUP(EingabeMaske!B$11,'Vergleichsfaktoren 2021 (2)'!A7:I3022,6)","v":0},1,2,3,4,5,6]
["a",{"$f":"IF(B$12=C$12,C13,IF(B$12=D$12,D13,IF(B$12=E$12,E13,IF(B$12=F$12,F13,IF(B$12=G$12,G13,IF(B$12=H$12,H13))))))","v":false},1.5800209999999999E-2,9.5811999999999998E-3,7.0361399999999998E-3,1.506292E-2,1.506292E-2,1.288152E-2]
["b",{"$f":"IF(B$12=C$12,C14,IF(B$12=D$12,D14,IF(B$12=E$12,E14,IF(B$12=F$12,F14,IF(B$12=G$12,G14,IF(B$12=H$12,H14))))))","v":false},0.31835323999999998,0.26586795000000002,0.13237351999999999,6.9398699999999994E-2,6.9398699999999994E-2,7.6059420000000003E-2]
["c",false,-0.18530284,-0.11846822,-0.10712051,-7.8638810000000003E-2,-7.8638810000000003E-2,-0.22657313000000001]
{"$rows_left_out":386}
{"sheet":"Vergleichsdaten 2023","index":5,"n_rows":184,"n_cols":11,"rows_kept":184,"cut":false,"hidden":true,"merged":[]}
[]
[{"$f":"EingabeMaske!A57","v":"Quelle: Oberer Gutachterausschuss für Grundstückswerte Rheinland-Pfalz gem. Landesgrundstückmarktbericht 2021"}]
[]
["Berücksichtigung der Wertverhältnisse zwischen dem Richtwertstichtag"]
[" und dem Wertermittlungsstichtag"]
["RLP"]
["Farblegende:",{"$f":"EingabeMaske!$D$15","v":"2020-01-01"},null,null,"Interpolation!",null,"Index","Stichtag","Ergänzung "]
["Fester Wert",{"$f":"B7-DATE(YEAR(B7)-1,12,31.25)","v":1},2025,{"$f":"(G8-G11)*$B11/365+G11","v":231.04657534246576},"2024-01-01","2024-12-31",248,"2025-01-01",{"$f":"ROUND(IF(YEAR($B$7)+1=C8,D8,0),2)","v":0}]
[null,{"$f":"B7-DATE(YEAR(B7)-1,12,31.25)","v":1},2024,{"$f":"(G9-G10)*$B11/365+G10","v":248},"2023-01-01","2023-12-31",248,"2024-01-01"]
[null,{"$f":"B7-DATE(YEAR(B7)-1,12,31.25)","v":1},2023,231.04657534246576,"2022-01-01","2022-12-31",248,"2023-01-01",{"$f":"ROUND(IF(YEAR($B$7)+1=C10,D10,0),2)","v":0}]
[null,{"$f":"B7-DATE(YEAR(B7)-1,12,31.25)","v":1},2022,212.05205479452056,"2021-01-01","2021-12-31",231,"2022-01-01",0]
[null,{"$f":"B7-DATE(YEAR(B7)-1,12,31.25)","v":1},2021,{"$f":"(G12-G13)*$B$18/365+G13","v":190.06027397260274},"2020-01-01","2020-12-31",212,"2021-01-01",190.06]
[null,{"$f":"B7-DATE(YEAR(B7)-1,12,31.25)","v":1},2020,{"$f":"(G13-G14)*$B14/365+G14","v":172.04931506849314},"2019-01-01","2019-12-31",190,"2020-01-01",0]
[null,{"$f":"B7-DATE(YEAR(B7)-1,12,31.25)","v":1},2019,157.04109589041096,"2018-01-01","2018-12-31",172,"2019-01-01",0]
[null,{"$f":"B7-DATE(YEAR(B7)-1,12,31.25)","v":1},2018,{"$f":"(G15-G16)*$B17/365+G16","v":144.03561643835616},"2017-01-01","2017-12-31",157,"2018-01-01",0]
{"$rows_left_out":170}
{"sheet":"GebStandard","index":6,"n_rows":25,"n_cols":19,"rows_kept":25,"cut":false,"hidden":false,"merged":[[0,1,0,11],[1,6,1,10],[24,1,24,3]]}
[null,"Gebäudestandards und Wägungsanteile für Mehrfamilienhäuser und Wohnhäuser mit Mischnutzung;\n\nStufen 3 - 5 gemäß Anlage 2 der SW-RL,\n\nStufen 1 + 2 Ergänzungen durch Sprengnetter"]
[null,null,null,null,null,null,{"$f":"EingabeMaske!A57","v":"Quelle: Oberer Gutachterausschuss für Grundstückswerte Rheinland-Pfalz gem. Landesgrundstückmarktbericht 2021"}]
[null,null,null,null,null,null,null,null,null,null,{"$f":"EingabeMaske!E1","v":"WE-Rechner 1 - 2023"}]
[null,"Wägungsan- teile (∑100 %)","Stufe 1",null,"Stufe 2",null,"Stufe 3",null,"Stufe 4",null,"Stufe 5"]
[null,"Außenwände","Holzfachwerk, Ziegelmauerwerk; Fugenglattstrich, Putz, Verkleidung mit Faserzementplatten, Bitumenschindeln oder einfachen Kunststoffplatten; kein oder deutlich nicht zeitgemäßer Wärmeschutz (vor ca. 1980)",null,"ein-/zweischaliges Mauerwerk, z. B. Gitterziegel oder Hohlblocksteine; verputzt und gestrichen oder Holzverkleidung; nicht zeitgemäßer Wärmeschutz (vor ca. 1995)",null,"ein-/zweischaliges Mauerwerk, z. B. aus Leichtziegeln, Kalksandsteinen, Gasbetonsteinen; Edelputz; Wärmedämmverbundsystem oder Wärmedämmputz (nach ca. 1995)",null,"Verblendmauerwerk, zweischalig, hinterlüftet, Vorhangfassade (z. B. Naturschiefer); Wärmedämmung (nach ca. 2005)",null,"aufwendig gestaltete Fassaden mit konstruktiver Gliederung (Säulenstell-ungen, Erker etc.), Sichtbeton-Fertig-teile, Natursteinfassade, Elemente aus Kupfer-/Eloxalblech, mehrgeschoss. Glasfassaden; hochwertigste Dämmung",null,null,{"$f":"IF(N6=TRUE,1,0)","v":0},{"$f":"IF(O6=TRUE,1,0)","v":0},1,0,0]
[null,"23%",{"$f":"ROUND($B6/$S6*N5,4)","v":0},null,{"$f":"ROUND($B6/$S6*O5,4)","v":0},null,{"$f":"ROUND($B6/$S6*P5,4)","v":0.23},null,{"$f":"ROUND($B6/$S6*Q5,4)","v":0},null,{"$f":"ROUND($B6/$S6*R5,4)","v":0},null,null,false,false,true,false,false,{"$f":"COUNTIF(N6:R6,TRUE)","v":1}]
[null,"Dach","Dachpappe, Faserzementplatten/ Wellplatten; keine bis geringe Dachdämmung",null,"einfache Betondachsteine oder Tondachziegel,  Bitumenschindeln; nicht zeitgemäße Dachdämmung (vor ca. 1995)",null,"Faserzement-Schindeln, beschichtete Betondachsteine und Tondachziegel, Folienabdichtung; Dachdämmung (nach ca. 1995)",null,"glasierte Tondachziegel, Flachdach- ausbildung tlw. als Dachterrassen; Konstruktion in Brettschichtholz, schweres Massivflachdach; besondere Dachformen, z. B. Mansarden-, Walmdach; Aufsparrendämmung, überdurchschn. Dämmung (nach ca. 2005)",null,"hochwertige Eindeckung z. B. aus Schiefer oder Kupfer, Dachbegrünung, befahrbares Flachdach; stark überdurchschnittliche Dämmung",null,null,{"$f":"IF(N8=TRUE,1,0)","v":0},{"$f":"IF(O8=TRUE,1,0)","v":0},{"$f":"IF(P8=TRUE,1,0)","v":1},{"$f":"IF(Q8=TRUE,1,0)","v":0},{"$f":"IF(R8=TRUE,1,0)","v":0}]
[null,"15%",{"$f":"ROUND($B8/$S8*N7,4)","v":0},null,{"$f":"ROUND($B8/$S8*O7,4)","v":0},null,{"$f":"ROUND($B8/$S8*P7,4)","v":0.15},null,{"$f":"ROUND($B8/$S8*Q7,4)","v":0},null,{"$f":"ROUND($B8/$S8*R7,4)","v":0},null,null,false,false,true,false,false,{"$f":"COUNTIF(N8:R8,TRUE)","v":1}]
[null,"Fenster und Außentüren","Einfachverglasung; einfache Holztüren",null,"Zweifachverglasung (vor ca. 1995); Haustür mit nicht zeitgemäßem Wärmeschutz (vor ca. 1995)",null,"Zweifachverglasung (nach ca. 1995), Rollläden (manuell); Haustür mit zeitgemäßem Wärmeschutz (nach ca. 1995)",null,"Dreifachverglasung, Sonnenschutz- glas, aufwendigere Rahmen, Rollläden (elektr.); höherwertige Türanlagen z. B. mit Seitenteil, besonderer Einbruchschutz",null,"große feststehende Fensterflächen, Spezialverglasung (Schall- und Sonnenschutz); Außentüren in hochwertigen Materialien",null,null,{"$f":"IF(N10=TRUE,1,0)","v":0},{"$f":"IF(O10=TRUE,1,0)","v":0},{"$f":"IF(P10=TRUE,1,0)","v":1},{"$f":"IF(Q10=TRUE,1,0)","v":0},{"$f":"IF(R10=TRUE,1,0)","v":0}]
[null,"11%",{"$f":"ROUND($B10/$S10*N9,4)","v":0},null,{"$f":"ROUND($B10/$S10*O9,4)","v":0},null,{"$f":"ROUND($B10/$S10*P9,4)","v":0.11},null,{"$f":"ROUND($B10/$S10*Q9,4)","v":0},null,{"$f":"ROUND($B10/$S10*R9,4)","v":0},null,null,false,false,true,false,false,{"$f":"COUNTIF(N10:R10,TRUE)","v":1}]
[null,"Innenwände und -türen","Fachwerkwände, einfache Putze/Lehmputze, einfache Kalkanstriche; Füllungstüren, gestrichen, mit einfachen Beschlägen ohne Dichtungen",null,"massive tragende Innenwände, nicht tragende Wände in Leichtbauweise   (z. B. Holzständerwände mit Gipskarton), Gipsdielen; leichte Türen, Stahlzargen",null,"nicht tragende Innenwände in massiver Ausführung bzw. mit Dämmmaterial gefüllte Ständerkonstruktionen; schwere Türen",null,"Sichtmauerwerk; Massivholztüren, Schiebetürelemente, Glastüren, strukturierte Türblätter",null,"gestaltete Wandabläufe (z. B. Pfeilervorlagen, abgesetzte oder geschwungene Wandpartien);  Brandschutzverkleidung; raumhohe aufwendige Türelemente",null,null,{"$f":"IF(N12=TRUE,1,0)","v":0},{"$f":"IF(O12=TRUE,1,0)","v":0},{"$f":"IF(P12=TRUE,1,0)","v":1},{"$f":"IF(Q12=TRUE,1,0)","v":0},{"$f":"IF(R12=TRUE,1,0)","v":0}]
[null,"11%",{"$f":"ROUND($B12/$S12*N11,4)","v":0},null,{"$f":"ROUND($B12/$S12*O11,4)","v":0},null,{"$f":"ROUND($B12/$S12*P11,4)","v":0.11},null,{"$f":"ROUND($B12/$S12*Q11,4)","v":0},null,{"$f":"ROUND($B12/$S12*R11,4)","v":0},null,null,false,false,true,false,false,{"$f":"COUNTIF(N12:R12,TRUE)","v":1}]
[null,"Deckenkon- struktion","Holzbalkendecken ohne Füllung, Spalierputz",null,"Holzbalkendecken mit Füllung, Kappendecken",null,"Betondecken mit Tritt- und Luftschallschutz (z. B. schwimmender Estrich); einfacher Putz",null,"zusätzlich Deckenverkleidung",null,"Deckenvertäfelungen (Edelholz, Metall)",null,null,{"$f":"IF(N14=TRUE,1,0)","v":0},{"$f":"IF(O14=TRUE,1,0)","v":0},{"$f":"IF(P14=TRUE,1,0)","v":1},{"$f":"IF(Q14=TRUE,1,0)","v":0},{"$f":"IF(R14=TRUE,1,0)","v":0}]
[null,"11%",{"$f":"ROUND($B14/$S14*N13,4)","v":0},null,{"$f":"ROUND($B14/$S14*O13,4)","v":0},null,{"$f":"ROUND($B14/$S14*P13,4)","v":0.11},null,{"$f":"ROUND($B14/$S14*Q13,4)","v":0},null,{"$f":"ROUND($B14/$S14*R13,4)","v":0},null,null,false,false,true,false,false,{"$f":"COUNTIF(N14:R14,TRUE)","v":1}]
[null,"Fußböden ","ohne Belag",null,"Linoleum-, Teppich-, Laminat- und PVC-Böden einfacher Art und Ausführung",null,"Linoleum-, Teppich-, Laminat- und PVC-Böden besserer Art und Ausführung, Fliesen, Kunststeinplatten",null,"Natursteinplatten, Fertigparkett, hochwertige Fliesen, Terrazzobelag, hochwertige Massivholzböden auf aufgedämmter Unterkonstruktion",null,"hochwertiges Parkett, hochwertige Natursteinplatten, hochwertige Edelholzböden auf gedämmter Unterkonstruktion",null,null,{"$f":"IF(N16=TRUE,1,0)","v":0},{"$f":"IF(O16=TRUE,1,0)","v":0},{"$f":"IF(P16=TRUE,1,0)","v":1},{"$f":"IF(Q16=TRUE,1,0)","v":0},{"$f":"IF(R16=TRUE,1,0)","v":0}]
{"$rows_left_out":11}
{"sheet":"RND","index":7,"n_rows":33,"n_cols":18,"rows_kept":33,"cut":false,"hidden":false,"merged":[[32,1,32,3],[32,5,32,7],[33,0,33,4],[33,5,33,8],[26,0,31,0],[26,5,26,8],[27,1,27,4],[27,5,27,8],[28,1,28,4],[28,5,28,7],[29,1,29,8],[30,1,30,4],[30,5,30,7],[31,5,31,7],[25,11,25,15],[14,0,16,9],[17,0,17,9],[18,0,18,4],[18,5,18,7],[19,0,19,4],[20,0,20,4],[21,0,21,4],[22,0,22,4],[23,0,23,4],[24,0,24,8],[25,0,25,8],[10,0,10,4],[10,5,10,7],[11,0,11,4],[11,5,11,7],[12,0,12,4],[12,5,12,7],[7,0,7,4],[7,5,7,7],[8,0,8,4],[8,5,8,7],[9,0,9,4],[9,5,9,7],[4,0,4,4],[4,5,4,7],[5,0,5,4],[5,5,5,7],[6,0,6,4],[6,5,6,7],[0,29,3,29],[0,0,0,9],[1,0,1,9],[2,1,2,4],[2,5,2,7],[2,9,3,9],[3,0,3,4],[3,5,3,7]]}
["Modell zur Ableitung der wirtschaftlichen Restnutzungsdauer für Wohngebäude unter Berücksichtigung von Modernisierungen\n(SW-RL Anl. 4) "]
["in Anlehung an Ein- und Zweifamilienhäuser"]
["Objekt",null,null,null,null,"Satz-Nr.",null,null,null," Kommentar"]
["Modernisierungselemente",null,null,null,null,"max. Punkte",null,null,"tats. Punkte"]
["Dacherneuerung inklusive Verbesserung der Wärmedämmung",null,null,null,null,4,null,null,null,null,60,1]
["Modernisierung der Fenster und Außentüren",null,null,null,null,{"$f":"IF(I6>3,\"TILT max. 2 \",2)","v":2},null,null,null,null,65,2]
["Modernisierung der Leitungssysteme (Strom, Gas, Wasser, Abwasser)",null,null,null,null,{"$f":"IF(I7>3,\"TILT max. 2 \",2)","v":2},null,null,null,null,70,3]
["Modernisierung der Heizungsanlage",null,null,null,null,{"$f":"IF(I8>3,\"TILT max. 2 \",2)","v":2},null,null,null,null,75,4]
["Wärmedämmung der Außenwände",null,null,null,null,4,null,null,null,null,80]
["Modernisierung von Bädern ",null,null,null,null,{"$f":"IF(I10>3,\"TILT max. 2 \",2)","v":2},null,null,null,null,90]
["Modernisierung des Innenausbaus, z.B. Decken, Fußböden, Treppen",null,null,null,null,2,null,null,null,null,null,{"$f":"IF(AND(I3<>\"\",I13=0),\"Einblenden\",\"Ausblenden\")","v":"Ausblenden"}]
["Wesentliche Verbesserung der Grundrissgestaltung",null,null,null,null,2]
["Summe",null,null,null,null,{"$f":"SUM(F5:F12)","v":20},null,null,{"$f":"SUM(I5:I12)","v":0},null,null,{"$f":"IF(I13>0,#REF!=0)","v":false}]
[]
["Liegen die Maßnahmen weiter zurück, ist zu prüfen, ob nicht ein geringerer als der maximale Tabellenwert anzusetzen ist.\nSofern nicht modernisierte Bauelemente noch zeitgemäßen Ansprüchen genügen, sind entsprechende Punkte zu vergeben."]
{"$rows_left_out":19}
{"sheet":"Vergleichsfaktoren","index":8,"n_rows":272,"n_cols":6,"rows_kept":272,"cut":false,"hidden":true,"merged":[]}
["Nummer der Gemarkung"," Gemeinde / Gemarkung","Boden-wert - Niveau €/m²","Vergleichs-faktor         €/m² Wf","Sachwert-faktor           ø RLP","Regionaler Zu-/Abschlag"]
[119,"Altenkirchen (Ww) / Altenkirchen              ",85,1160,1.02,-0.03]
[4031,"Altrip / Altrip                    ",340,2335,1.45,0.02]
[3831,"Alzey / Alzey                     ",205,1685,1.28,0]
[1314,"Andernach / Andernach                 ",180,1650,1.24,0]
[5420,"Annweiler am Trifels / Annweiler                 ",160,1625,1.19,-0.03]
[5372,"Bad Bergzabern / Bad Bergzabern            ",235,1750,1.33,0]
[1151,"Bad Breisig / Niederbreisig             ",130,1460,1.1399999999999999,0.03]
[1152,"Bad Breisig / Oberbreisig               ",125,1440,1.1299999999999999,0.03]
[4351,"Bad Dürkheim / Bad Dürkheim              ",285,2190,1.39,7.0000000000000007E-2]
[4354,"Bad Dürkheim / Grethen                   ",200,1825,1.27,7.0000000000000007E-2]
[4355,"Bad Dürkheim / Hardenburg                ",160,1595,1.21,7.0000000000000007E-2]
[950,"Bad Ems / Ems                       ",85,1175,1.02,-0.02]
[326,"Bad Hönningen / Hönningen                 ",120,1380,1.1200000000000001,0]
[1942,"Bad Kreuznach / Bad Kreuznach Nord",170,1715,1.21,0]
{"$rows_left_out":258}
{"sheet":"modifizierte RND","index":9,"n_rows":37,"n_cols":23,"rows_kept":37,"cut":false,"hidden":true,"merged":[[18,0,37,0],[18,6,37,6],[37,1,37,5],[13,0,13,6],[14,0,14,6],[15,0,16,0],[15,2,16,4],[15,6,16,6],[17,0,17,6],[8,22,14,22],[5,0,5,2],[5,5,5,6],[6,0,6,6],[7,5,7,6],[8,0,8,6],[8,16,11,16],[9,5,9,6],[10,0,12,6],[8,17,14,17],[8,18,14,18],[8,19,14,19],[8,20,14,20],[8,21,14,21],[4,0,4,6],[0,0,0,6],[1,0,1,6],[2,0,2,6],[3,0,3,2],[3,5,3,6]]}
["Ermittlung der modifizierten Restnutzungsdauer"]
["SW-Modell AGVGA NRW    -    Anlage 4"]
[]
[" tatsächliches Gebäudealter (Alter):",null,null,{"$f":"RND!F29","v":30},"     Jahre",{"$f":"IF(D4<0,\"Negative Jahre ???\",\"\")","v":""}]
[]
[" Modernisierungsgrad:",null,null,{"$f":"IF(RND!I13<>0,RND!I13,RND!I13)","v":0},"     Punkte",{"$f":"IF(D6=\"\",\"\",IF(D6<=K16,\"(Modernisierungsstufe 1)\",IF(D6<6,\"(Modernisierungsstufe 2)\",IF(AND(D6>5,D6<11),\"(Modernisierungsstufe 3)\",IF(AND(D6>10,D6<18),\"(Modernisierungsstufe 4)\",IF(D6>=K33,\"(Modernisierungsstufe 5)\",\"\"))))))","v":"(Modernisierungsstufe 1)"}]
[]
[" Gesamtnutzungsdauer (GND):",null,null,{"$f":"RND!F31","v":70},"     Jahre",null,null,null,null,null,"mögliche Gesamtnutzungsdauer:",null,null,null,"relatives Gebäudealter"]
[null,null,null,null,null,null,null,null,null,null,60,null,null,null,{"$f":"D4/D8","v":0.42857142857142855},null,"Alter für Formel\nmax. Alter der GND","Prüfung, ob Formel anwendbar\n( \"ab einem relativen Alter\")","Formel nicht anwendbar, daher Jahre durch Abzug\nRND=GND-Alter\naber max. 80 Jahre!","Formel anwendbar\n\nmod. RND in Jahren","modifizierte RND","interpoliert ?","GND - Alter ?"]
[" modifizierte Restnutzungsdauer:",null,null,{"$f":"IF(D6=0,D8-D4,IF(AND(D4=\"\",D6=\"\",D8=\"\"),\"\",IF(D4<>\"\",IF(D6=\"\",\"Punkte ?\",IF(D8=\"\",\"GND ?\",U34)),\"s.o.\")))","v":40},"    Jahre",null,null,null,null,null,65]
["Bei der angezeigten modifizierten Restnutzungsdauer handelt es sich um eine interpolierte, mathematisch berechnete Zahl !",null,null,null,null,null,null,null,null,null,70]
[null,null,null,null,null,null,null,null,null,null,75]
[null,null,null,null,null,null,null,null,null,null,80]
["Tabelle zur Ermittlung der modifizierten Restnutzungsdauer",null,null,null,null,null,null,null,null,null,90,null,null,null,null,null,{"$f":"IF(D4>D8,D8,D4)","v":30}]
[null,null,null,null,null,null,null,null,null,null,"Modernisierungsgrad:",null,{"$f":"IF(D6=K16,1,IF(D6=K33,18,D6))","v":0},"a","b","c"]
{"$rows_left_out":23}
{"sheet":"Info","index":10,"n_rows":49,"n_cols":1,"rows_kept":49,"cut":false,"hidden":true,"merged":[]}
["WE-Rechner RLP (MS-Excel 2007)"]
[]
["Update-Informationen"]
[]
["Version 1.0 - 2017   Stand 16.3.2017"]
["Neuprogrammierung nach dem Modell des LGMB 2017"]
[]
["Version 1.1 - 2017   Stand 10.4.2017"]
["● Blatt \"Berechnung und Ergebnis\", Zelle D65 - Berichtigung eines Rechenfehlers: Formelbezug D16 geändert in D17"]
["● Blatt \"EingabeMaske\", Zellen D30 und D31 - Öffnen der Obergrenze für Bodenwerte von 450 €/m² auf 900 €/m² mit Warnhinweis bei Werten über 450 €/m²"]
["● Blatt \"Vergleichsfaktoren\" - Zellen D211 und E211: Anhebung des Richtwertes für Mainz, Elsa-Brändström-Straße von 2.300 €/m² Wf auf 2.700 €/m²Wf mit entsprechender Anpassung des Sachwertfaktors von 1,37 auf 1,34"]
[]
["Version 1.2 - 2017   Stand 11.5.2017"]
["Blatt \"Vergleichsfaktoren\"  - Zellen D326 bis D335: Anhebung der Richtwerte für die Stadt Trier"]
["●  von 1.450 €/m² Wf auf 1.600 €/m²Wf mit entsprechender Anpassung des Sachwertfaktors von 1,07 auf 1,06"]
{"$rows_left_out":35}
{"sheet":"Werte Neu","index":11,"n_rows":6,"n_cols":2,"rows_kept":6,"cut":false,"hidden":true,"merged":[]}
["Garage",7000]
["Doppelgarage",12000]
["Carport",4000]
["Carport und Garage",11000]
["Aussenstellplatz",3500]
["Sonstiges (freie Eingabe)",0]